Reaction Details
TargetVascular endothelial growth factor receptor 1
LigandBDBM50146165
Substrate/Competitorn/a
Meas. Tech.ChEMBL_1555016 (CHEMBL3767456)
IC50 3.0±n/a nM
Citation Zhang, JJiang, XJiang, YGuo, MZhang, SLi, JHe, JLiu, JWang, JOuyang, L Recent advances in the development of dual VEGFR and c-Met small molecule inhibitors as anticancer drugs. Eur J Med Chem108:495-504 (2016) 
 
Vascular endothelial growth factor receptor 1
Name:Vascular endothelial growth factor receptor 1
Type:Receptor Tyrosine Kinase
Mol. Mass.:150800.23
Organism:Homo sapiens (Human)
Description:P17948
Residue:1338
BDBM50146165
NameBDBM50146165
Synonyms:CHEMBL3764474
TypeSmall organic molecule
Emp. Form.C26H20FN5O2S2
Mol. Mass.517.598
SMILESCn1ccnc1-c1cc2c(Oc3ccc(NC(=S)NC(=O)Cc4ccccc4)cc3F)ccnc2s1