Reaction Details
TargetHepatocyte growth factor receptor
LigandBDBM60589
Substrate/Competitorn/a
Meas. Tech.ChEMBL_1555042 (CHEMBL3767620)
IC50 4.0±n/a nM
Citation Zhang, JJiang, XJiang, YGuo, MZhang, SLi, JHe, JLiu, JWang, JOuyang, L Recent advances in the development of dual VEGFR and c-Met small molecule inhibitors as anticancer drugs. Eur J Med Chem108:495-504 (2016) 
 
Hepatocyte growth factor receptor
Name:Hepatocyte growth factor receptor
Type:Protein
Mol. Mass.:155559.73
Organism:Homo sapiens (Human)
Description:P08581
Residue:1390
BDBM60589
NameBDBM60589
Synonyms:6-{[6-(1-methyl-1H-pyrazol-4-yl)-[1,2,4]triazolo[4,3-b]pyridazin-3-yl]sulfanyl}quinoline (4) | BDBM50355498
Typen/a
Emp. Form.C18H13N7S
Mol. Mass.359.408
SMILESCn1cc(cn1)-c1ccc2nnc(Sc3ccc4ncccc4c3)n2n1