Reaction Details
TargetSucrase-isomaltase, intestinal
LigandBDBM50147013
Substrate/Competitorn/a
Meas. Tech.ChEMBL_1554225 (CHEMBL3766264)
Ki 185±n/a nM
Citation Liu, DHe, WWang, ZLiu, LWang, CZhang, CWang, CWang, YTanabe, GMuraoka, OWu, XWu, LXie, W Design, synthesis and biological evaluation of 3'-benzylated analogs of 3'-epi-neoponkoranol as potenta-glucosidase inhibitors. Eur J Med Chem110:224-36 (2016) 
 
Sucrase-isomaltase, intestinal
Name:Sucrase-isomaltase, intestinal
Type:Enzyme
Mol. Mass.:210329.04
Organism:Rattus norvegicus (Rat)
Description:P23739
Residue:1841
BDBM50147013
NameBDBM50147013
Synonyms:CHEMBL3764559
TypeSmall organic molecule
Emp. Form.C18H28ClNO10S
Mol. Mass.485.934
SMILES[Cl-].OC[C@H](O)[C@@H](O)[C@@H](OCc1ccccc1[N+]([O-])=O)[C@H](O)C[S+]1C[C@@H](O)[C@H](O)[C@H]1CO