Reaction Details
TargetSucrase-isomaltase, intestinal
LigandBDBM50147158
Substrate/Competitorn/a
Meas. Tech.ChEMBL_1554225 (CHEMBL3766264)
Ki 353±n/a nM
Citation Liu, DHe, WWang, ZLiu, LWang, CZhang, CWang, CWang, YTanabe, GMuraoka, OWu, XWu, LXie, W Design, synthesis and biological evaluation of 3'-benzylated analogs of 3'-epi-neoponkoranol as potenta-glucosidase inhibitors. Eur J Med Chem110:224-36 (2016) 
 
Sucrase-isomaltase, intestinal
Name:Sucrase-isomaltase, intestinal
Type:Enzyme
Mol. Mass.:210329.04
Organism:Rattus norvegicus (Rat)
Description:P23739
Residue:1841
BDBM50147158
NameBDBM50147158
Synonyms:CHEMBL3764745
TypeSmall organic molecule
Emp. Form.C19H28ClF3O8S
Mol. Mass.508.934
SMILES[Cl-].OC[C@H](O)[C@@H](O)[C@@H](OCc1cccc(c1)C(F)(F)F)[C@H](O)C[S+]1C[C@@H](O)[C@H](O)[C@H]1CO