Reaction Details
TargetEpidermal growth factor receptor
LigandBDBM50148026
Substrate/Competitorn/a
Meas. Tech.ChEMBL_1556348 (CHEMBL3766407)
IC50 3.6±n/a nM
Citation Tu, YOuYang, YXu, SZhu, YLi, GSun, CZheng, PZhu, W Design, synthesis, and docking studies of afatinib analogs bearing cinnamamide moiety as potent EGFR inhibitors. Bioorg Med Chem24:1495-503 (2016) 
 
Epidermal growth factor receptor
Name:Epidermal growth factor receptor
Type:Receptor Kinase Domain
Mol. Mass.:134279.59
Organism:Homo sapiens (Human)
Description:P00533
Residue:1210
BDBM50148026
NameBDBM50148026
Synonyms:CHEMBL3763790
TypeSmall organic molecule
Emp. Form.C30H28ClFN4O6
Mol. Mass.595.018
SMILESCOc1ccc(\C=C\C(=O)Nc2cc3c(Nc4ccc(F)c(Cl)c4)ncnc3cc2O[C@H]2CCOC2)c(OC)c1OC