Reaction Details
TargetPhosphatidylinositol 4,5-bisphosphate 3-kinase catalytic subunit alpha isoform
LigandBDBM50149545
Substrate/Competitorn/a
Meas. Tech.ChEMBL_1557990 (CHEMBL3774221)
Ki 1.000000±n/a nM
Citation Heffron, TPHeald, RANdubaku, CWei, BAugistin, MDo, SEdgar, KEigenbrot, CFriedman, LGancia, EJackson, PSJones, GKolesnikov, ALee, LBLesnick, JDLewis, CMcLean, NMörtl, MNonomiya, JPang, JPrice, SPrior, WWSalphati, LSideris, SStaben, STSteinbacher, STsui, VWallin, JSampath, DOlivero, AG The Rational Design of Selective Benzoxazepin Inhibitors of thea-Isoform of Phosphoinositide 3-Kinase Culminating in the Identification of (S)-2-((2-(1-Isopropyl-1H-1,2,4-triazol-5-yl)-5,6-dihydrobenzo[f]imidazo[1,2-d][1,4]oxazepin-9-yl)oxy)propanamide (GDC-0326). J Med Chem59:985-1002 (2016) 
 
Phosphatidylinositol 4,5-bisphosphate 3-kinase catalytic subunit alpha isoform
Name:Phosphatidylinositol 4,5-bisphosphate 3-kinase catalytic subunit alpha isoform
Type:Enzyme Subunit
Mol. Mass.:124294.87
Organism:Homo sapiens (Human)
Description:P42336
Residue:1068
BDBM50149545
NameBDBM50149545
Synonyms:CHEMBL3770824
TypeSmall organic molecule
Emp. Form.C18H21N7O3
Mol. Mass.383.4044
SMILESCC(C)n1ncnc1-c1cn2CCOc3cc(O[C@@H](C)C(N)=O)ncc3-c2n1