Reaction Details
TargetTransient receptor potential cation channel subfamily V member 1
LigandBDBM50398494
Substrate/Competitorn/a
Meas. Tech.ChEMBL_1558820 (CHEMBL3772448)
Ki 3±n/a nM
Citation Ann, JKi, YYoon, SKim, MSLee, JUKim, CLee, SJung, ABaek, JHong, SChoi, SPearce, LVEsch, TETurcios, NALewin, NEOgunjirin, AEHerold, BKMcCall, AKBlumberg, PMLee, J 2-Sulfonamidopyridine C-region analogs of 2-(3-fluoro-4-methylsulfonamidophenyl)propanamides as potent TRPV1 antagonists. Bioorg Med Chem24:1231-40 (2016) 
 
Transient receptor potential cation channel subfamily V member 1
Name:Transient receptor potential cation channel subfamily V member 1
Type:Protein
Mol. Mass.:94960.75
Organism:Homo sapiens (Human)
Description:Q8NER1
Residue:839
BDBM50398494
NameBDBM50398494
Synonyms:CHEMBL2177429
TypeSmall organic molecule
Emp. Form.C23H28F4N4O3S
Mol. Mass.516.552
SMILESC[C@H](C(=O)NCc1ccc(nc1N1CCC(C)CC1)C(F)(F)F)c1ccc(NS(C)(=O)=O)c(F)c1