Reaction Details
TargetTransient receptor potential cation channel subfamily V member 1
LigandBDBM50151111
Substrate/Competitorn/a
Meas. Tech.ChEMBL_1558820 (CHEMBL3772448)
Ki 2.3±n/a nM
Citation Ann, JKi, YYoon, SKim, MSLee, JUKim, CLee, SJung, ABaek, JHong, SChoi, SPearce, LVEsch, TETurcios, NALewin, NEOgunjirin, AEHerold, BKMcCall, AKBlumberg, PMLee, J 2-Sulfonamidopyridine C-region analogs of 2-(3-fluoro-4-methylsulfonamidophenyl)propanamides as potent TRPV1 antagonists. Bioorg Med Chem24:1231-40 (2016) 
 
Transient receptor potential cation channel subfamily V member 1
Name:Transient receptor potential cation channel subfamily V member 1
Type:Protein
Mol. Mass.:94960.75
Organism:Homo sapiens (Human)
Description:Q8NER1
Residue:839
BDBM50151111
NameBDBM50151111
Synonyms:CHEMBL3771102
TypeSmall organic molecule
Emp. Form.C30H27F5N4O5S2
Mol. Mass.682.681
SMILESCC(C(=O)NCc1ccc(nc1N(Cc1ccc(F)cc1)S(=O)(=O)c1ccccc1)C(F)(F)F)c1ccc(NS(C)(=O)=O)c(F)c1