Reaction Details
TargetcAMP-specific 3',5'-cyclic phosphodiesterase 4A
LigandBDBM50150128
Substrate/Competitorn/a
Meas. Tech.ChEMBL_1556442 (CHEMBL3772473)
Ki 3400±n/a nM
Citation Li, PZheng, HZhao, JZhang, LYao, WZhu, HBeard, JDIda, KLane, WSnell, GSogabe, SHeyser, CJSnyder, GLHendrick, JPVanover, KEDavis, REWennogle, LP Discovery of Potent and Selective Inhibitors of Phosphodiesterase 1 for the Treatment of Cognitive Impairment Associated with Neurodegenerative and Neuropsychiatric Diseases. J Med Chem59:1149-64 (2016) 
 
cAMP-specific 3',5'-cyclic phosphodiesterase 4A
Name:cAMP-specific 3',5'-cyclic phosphodiesterase 4A
Type:Enzyme
Mol. Mass.:98113.27
Organism:Homo sapiens (Human)
Description:P27815
Residue:886
BDBM50150128
NameBDBM50150128
Synonyms:CHEMBL3769662
TypeSmall organic molecule
Emp. Form.C28H26N6O
Mol. Mass.462.5456
SMILESC[C@@H]1CN2C(=N1)N(C)C(=O)c1c2nn(Cc2ccc(cc2)-c2ccccc2)c1Nc1ccccc1