Reaction Details
TargetcAMP-specific 3',5'-cyclic phosphodiesterase 4A
LigandBDBM50150280
Substrate/Competitorn/a
Meas. Tech.ChEMBL_1556442 (CHEMBL3772473)
Ki 550±n/a nM
Citation Li, PZheng, HZhao, JZhang, LYao, WZhu, HBeard, JDIda, KLane, WSnell, GSogabe, SHeyser, CJSnyder, GLHendrick, JPVanover, KEDavis, REWennogle, LP Discovery of Potent and Selective Inhibitors of Phosphodiesterase 1 for the Treatment of Cognitive Impairment Associated with Neurodegenerative and Neuropsychiatric Diseases. J Med Chem59:1149-64 (2016) 
 
cAMP-specific 3',5'-cyclic phosphodiesterase 4A
Name:cAMP-specific 3',5'-cyclic phosphodiesterase 4A
Type:Enzyme
Mol. Mass.:98113.27
Organism:Homo sapiens (Human)
Description:P27815
Residue:886
BDBM50150280
NameBDBM50150280
Synonyms:CHEMBL3770641
TypeSmall organic molecule
Emp. Form.C24H21F3N6O
Mol. Mass.466.4583
SMILES[H][C@@]12CCC[C@]1([H])N1C(NC(=O)c3c(Nc4ccccc4)n(Cc4ccc(cc4)C(F)(F)F)nc13)=N2