Reaction Details
TargetLysine-specific demethylase 5B
LigandBDBM50153073
Substrate/Competitorn/a
Meas. Tech.ChEMBL_1561971 (CHEMBL3778807)
IC50 16±n/a nM
Citation Bavetsias, VLanigan, RMRuda, GFAtrash, BMcLaughlin, MGTumber, AMok, NYLe Bihan, YVDempster, SBoxall, KJJeganathan, FHatch, SBSavitsky, PVelupillai, SKrojer, TEngland, KSSejberg, JThai, CDonovan, APal, AScozzafava, GBennett, JMKawamura, AJohansson, CSzykowska, AGileadi, CBurgess-Brown, NAvon Delft, FOppermann, UWalters, ZShipley, JRaynaud, FIWestaway, SMPrinjha, RKFedorov, OBurke, RSchofield, CJWestwood, IMBountra, CMüller, Svan Montfort, RLBrennan, PEBlagg, J 8-Substituted Pyrido[3,4-d]pyrimidin-4(3H)-one Derivatives As Potent, Cell Permeable, KDM4 (JMJD2) and KDM5 (JARID1) Histone Lysine Demethylase Inhibitors. J Med Chem59:1388-409 (2016) 
 
Lysine-specific demethylase 5B
Name:Lysine-specific demethylase 5B
Type:Protein
Mol. Mass.:175659.67
Organism:Homo sapiens (Human)
Description:Q9UGL1
Residue:1544
BDBM50153073
NameBDBM50153073
Synonyms:CHEMBL3775451
TypeSmall organic molecule
Emp. Form.C25H26N6O3
Mol. Mass.458.5123
SMILESO=c1[nH]cnc2c(nccc12)-n1cc(CCN2CCC(Cc3ccc4OCOc4c3)CC2)cn1