Reaction Details
TargetLysine-specific demethylase 4A
LigandBDBM50153152
Substrate/Competitorn/a
Meas. Tech.ChEMBL_1561969 (CHEMBL3778805)
IC50 13100±n/a nM
Citation Bavetsias, VLanigan, RMRuda, GFAtrash, BMcLaughlin, MGTumber, AMok, NYLe Bihan, YVDempster, SBoxall, KJJeganathan, FHatch, SBSavitsky, PVelupillai, SKrojer, TEngland, KSSejberg, JThai, CDonovan, APal, AScozzafava, GBennett, JMKawamura, AJohansson, CSzykowska, AGileadi, CBurgess-Brown, NAvon Delft, FOppermann, UWalters, ZShipley, JRaynaud, FIWestaway, SMPrinjha, RKFedorov, OBurke, RSchofield, CJWestwood, IMBountra, CMüller, Svan Montfort, RLBrennan, PEBlagg, J 8-Substituted Pyrido[3,4-d]pyrimidin-4(3H)-one Derivatives As Potent, Cell Permeable, KDM4 (JMJD2) and KDM5 (JARID1) Histone Lysine Demethylase Inhibitors. J Med Chem59:1388-409 (2016) 
 
Lysine-specific demethylase 4A
Name:Lysine-specific demethylase 4A
Type:Enzyme
Mol. Mass.:120647.83
Organism:Homo sapiens (Human)
Description:O75164
Residue:1064
BDBM50153152
NameBDBM50153152
Synonyms:CHEMBL3775453
TypeSmall organic molecule
Emp. Form.C13H17N5O
Mol. Mass.259.307
SMILESCN1CCN(Cc2nccc3c2nc[nH]c3=O)CC1