Reaction Details
Target5-hydroxytryptamine receptor 7
LigandBDBM78940
Substrate/Competitorn/a
Meas. Tech.ChEMBL_1559219 (CHEMBL3772071)
IC50 21±n/a nM
Citation Kucwaj-Brysz, KWarszycki, DPodlewska, SWitek, JWitek, KGonzález Izquierdo, ASatala, GLoza, MILubelska, ALatacz, GBojarski, AJCastro, MKiec-Kononowicz, KHandzlik, J Rational design in search for 5-phenylhydantoin selective 5-HT7R antagonists. Molecular modeling, synthesis and biological evaluation. Eur J Med Chem112:258-69 (2016) 
 
5-hydroxytryptamine receptor 7
Name:5-hydroxytryptamine receptor 7
Type:G Protein-Coupled Receptor (GPCR)
Mol. Mass.:53573.08
Organism:Homo sapiens (Human)
Description:P34969
Residue:479
BDBM78940
NameBDBM78940
Synonyms:METHIOTHEPIN Methiothepin mesylate salt cid_3039995 methanesulfonic acid;1-methyl-4-(3-methylsulfanyl-5,6-dihydrobenzo[b][1]benzothiepin-5-yl)piperazine | methanesulfonic acid;1-methyl-4-[3-(methylthio)-5,6-dihydrobenzo[b][1]benzothiepin-5-yl]piperazine
TypeSmall organic molecule
Emp. Form.C20H24N2S2
Mol. Mass.356.548
SMILESCSc1ccc2Sc3ccccc3CC(N3CCN(C)CC3)c2c1