Reaction Details
TargetD(2) dopamine receptor
LigandBDBM35254
Substrate/Competitorn/a
Meas. Tech.ChEMBL_1559213 (CHEMBL3771916)
Ki 9.0±n/a nM
Citation Kucwaj-Brysz, KWarszycki, DPodlewska, SWitek, JWitek, KGonzález Izquierdo, ASatala, GLoza, MILubelska, ALatacz, GBojarski, AJCastro, MKiec-Kononowicz, KHandzlik, J Rational design in search for 5-phenylhydantoin selective 5-HT7R antagonists. Molecular modeling, synthesis and biological evaluation. Eur J Med Chem112:258-69 (2016) 
 
D(2) dopamine receptor
Name:D(2) dopamine receptor
Type:Cell-surface receptors
Mol. Mass.:50647.10
Organism:Homo sapiens (Human)
Description:P14416
Residue:443
BDBM35254
NameBDBM35254
Synonyms:2-methyl-4-(4-methylpiperazin-1-yl)-10H-thieno[2,3-b][1,5]benzodiazepine Olansek Zyprexa | olanzapine
TypeSmall organic molecule
Emp. Form.C17H20N4S
Mol. Mass.312.432
SMILESCN1CCN(CC1)C1=Nc2ccccc2Nc2sc(C)cc12