Reaction Details
TargetLysine-specific demethylase 4C
LigandBDBM50151404
Substrate/Competitorn/a
Meas. Tech.ChEMBL_1561029 (CHEMBL3776325)
IC50 2500±n/a nM
Citation Korczynska, MLe, DDYounger, NGregori-Puigjané, ETumber, AKrojer, TVelupillai, SGileadi, CNowak, RPIwasa, EPollock, SBOrtiz Torres, IOppermann, UShoichet, BKFujimori, DG Docking and Linking of Fragments To Discover Jumonji Histone Demethylase Inhibitors. J Med Chem59:1580-98 (2016) 
 
Lysine-specific demethylase 4C
Name:Lysine-specific demethylase 4C
Type:Protein
Mol. Mass.:119979.01
Organism:Homo sapiens (Human)
Description:Q9H3R0
Residue:1056
BDBM50151404
NameBDBM50151404
Synonyms:CHEMBL3774894
TypeSmall organic molecule
Emp. Form.C19H15BrN2O3
Mol. Mass.399.238
SMILESOC(=O)c1ccnc(c1)-c1cc(NCc2ccc(Br)cc2)ccc1O