Reaction Details
TargetHepatocyte growth factor receptor
LigandBDBM50152684
Substrate/Competitorn/a
Meas. Tech.ChEMBL_1565051 (CHEMBL3782289)
IC50 1.8±n/a nM
Citation Tang, QZhai, XTu, YWang, PWang, LWu, CWang, WXie, HGong, PZheng, P Synthesis and antiproliferative activity of 6,7-disubstituted-4-phenoxyquinoline derivatives bearing the 2-oxo-4-chloro-1,2-dihydroquinoline-3-carboxamide moiety. Bioorg Med Chem Lett26:1794-8 (2016) 
 
Hepatocyte growth factor receptor
Name:Hepatocyte growth factor receptor
Type:Protein
Mol. Mass.:155559.73
Organism:Homo sapiens (Human)
Description:P08581
Residue:1390
BDBM50152684
NameBDBM50152684
Synonyms:CHEMBL3781716
TypeSmall organic molecule
Emp. Form.C40H37ClFN5O5
Mol. Mass.722.204
SMILESCOc1cc2c(Oc3ccc(NC(=O)c4c(Cl)c5ccccc5n(-c5ccccc5)c4=O)cc3F)ccnc2cc1OCCCN1CCN(C)CC1