Reaction Details
TargetVascular endothelial growth factor receptor 2
LigandBDBM50152685
Substrate/Competitorn/a
Meas. Tech.ChEMBL_1565055 (CHEMBL3782293)
IC50 543±n/a nM
Citation Tang, QZhai, XTu, YWang, PWang, LWu, CWang, WXie, HGong, PZheng, P Synthesis and antiproliferative activity of 6,7-disubstituted-4-phenoxyquinoline derivatives bearing the 2-oxo-4-chloro-1,2-dihydroquinoline-3-carboxamide moiety. Bioorg Med Chem Lett26:1794-8 (2016) 
 
Vascular endothelial growth factor receptor 2
Name:Vascular endothelial growth factor receptor 2
Type:Receptor Tyrosine Kinase
Mol. Mass.:151510.97
Organism:Homo sapiens (Human)
Description:P35968
Residue:1356
BDBM50152685
NameBDBM50152685
Synonyms:CHEMBL3780676
TypeSmall organic molecule
Emp. Form.C40H36ClF2N5O5
Mol. Mass.740.194
SMILESCOc1cc2c(Oc3ccc(NC(=O)c4c(Cl)c5ccccc5n(-c5ccc(F)cc5)c4=O)cc3F)ccnc2cc1OCCCN1CCN(C)CC1