Reaction Details
TargetPlatelet-derived growth factor receptor beta
LigandBDBM50154813
Substrate/Competitorn/a
Meas. Tech.ChEMBL_1561420 (CHEMBL3779156)
IC50 4.6±n/a nM
Citation Tang, QWang, LTu, YZhu, WLuo, RTu, QWang, PWu, CGong, PZheng, P Discovery of novel pyrrolo[2,3-b]pyridine derivatives bearing 1,2,3-triazole moiety as c-Met kinase inhibitors. Bioorg Med Chem Lett26:1680-4 (2016) 
 
Platelet-derived growth factor receptor beta
Name:Platelet-derived growth factor receptor beta
Type:Enzyme
Mol. Mass.:123922.25
Organism:Homo sapiens (Human)
Description:P09619
Residue:1106
BDBM50154813
NameBDBM50154813
Synonyms:CHEMBL3774451
TypeSmall organic molecule
Emp. Form.C23H13F5N6O2
Mol. Mass.500.3803
SMILESFc1ccc(cc1)-n1nnc(C(=O)Nc2ccc(Oc3ccnc4[nH]ccc34)c(F)c2)c1C(F)(F)F