Reaction Details
TargetHepatocyte growth factor receptor
LigandBDBM50154824
Substrate/Competitorn/a
Meas. Tech.ChEMBL_1561414 (CHEMBL3778974)
IC50 7.3±n/a nM
Citation Tang, QWang, LTu, YZhu, WLuo, RTu, QWang, PWu, CGong, PZheng, P Discovery of novel pyrrolo[2,3-b]pyridine derivatives bearing 1,2,3-triazole moiety as c-Met kinase inhibitors. Bioorg Med Chem Lett26:1680-4 (2016) 
 
Hepatocyte growth factor receptor
Name:Hepatocyte growth factor receptor
Type:Protein
Mol. Mass.:155559.73
Organism:Homo sapiens (Human)
Description:P08581
Residue:1390
BDBM50154824
NameBDBM50154824
Synonyms:CHEMBL3774954
TypeSmall organic molecule
Emp. Form.C23H14F4N6O2
Mol. Mass.482.3899
SMILESFc1cc(NC(=O)c2nnn(c2C(F)(F)F)-c2ccccc2)ccc1Oc1ccnc2[nH]ccc12