Reaction Details
TargetHepatocyte growth factor receptor
LigandBDBM50154840
Substrate/Competitorn/a
Meas. Tech.ChEMBL_1561414 (CHEMBL3778974)
IC50 21±n/a nM
Citation Tang, QWang, LTu, YZhu, WLuo, RTu, QWang, PWu, CGong, PZheng, P Discovery of novel pyrrolo[2,3-b]pyridine derivatives bearing 1,2,3-triazole moiety as c-Met kinase inhibitors. Bioorg Med Chem Lett26:1680-4 (2016) 
 
Hepatocyte growth factor receptor
Name:Hepatocyte growth factor receptor
Type:Protein
Mol. Mass.:155559.73
Organism:Homo sapiens (Human)
Description:P08581
Residue:1390
BDBM50154840
NameBDBM50154840
Synonyms:CHEMBL3774694
TypeSmall organic molecule
Emp. Form.C24H13ClF6N6O2
Mol. Mass.566.842
SMILESFC(F)(F)c1c(nnn1-c1ccc(Cl)c(c1)C(F)(F)F)C(=O)Nc1ccc(Oc2ccnc3[nH]ccc23)cc1