Reaction Details
TargetSteroid 17-alpha-hydroxylase/17,20 lyase
LigandBDBM50156232
Substrate/Competitorn/a
Meas. Tech.ChEMBL_1563722 (CHEMBL3783933)
IC50 2.0±n/a nM
Citation Huang, AJayaraman, LFura, AVite, GDTrainor, GLGottardis, MMSpires, TESpires, VMRizzo, CAObermeier, MTElzinga, PATodderud, GFan, YNewitt, JABeyer, SMZhu, YWarrack, BMGoodenough, AKTebben, AJDoweyko, AMGold, DLBalog, A Discovery of the Selective CYP17A1 Lyase Inhibitor BMS-351 for the Treatment of Prostate Cancer. ACS Med Chem Lett7:40-5 (2016) 
 
Steroid 17-alpha-hydroxylase/17,20 lyase
Name:Steroid 17-alpha-hydroxylase/17,20 lyase
Type:Enzyme
Mol. Mass.:57382.42
Organism:Homo sapiens (Human)
Description:E.coli expressing human CYP17
Residue:508
BDBM50156232
NameBDBM50156232
Synonyms:CHEMBL3782020
TypeSmall organic molecule
Emp. Form.C18H14N4
Mol. Mass.286.3306
SMILESCc1ccncc1-c1cccc2n(ncc12)-c1ccccn1