Reaction Details
TargetSteroid 21-hydroxylase
LigandBDBM50391846
Substrate/Competitorn/a
Meas. Tech.ChEMBL_1563733 (CHEMBL3784034)
IC50>7500±n/a nM
Citation Huang, AJayaraman, LFura, AVite, GDTrainor, GLGottardis, MMSpires, TESpires, VMRizzo, CAObermeier, MTElzinga, PATodderud, GFan, YNewitt, JABeyer, SMZhu, YWarrack, BMGoodenough, AKTebben, AJDoweyko, AMGold, DLBalog, A Discovery of the Selective CYP17A1 Lyase Inhibitor BMS-351 for the Treatment of Prostate Cancer. ACS Med Chem Lett7:40-5 (2016) 
 
Steroid 21-hydroxylase
Name:Steroid 21-hydroxylase
Type:PROTEIN
Mol. Mass.:55896.25
Organism:Homo sapiens (Human)
Description:ChEMBL_1498865
Residue:494
BDBM50391846
NameBDBM50391846
Synonyms:CHEMBL2147041 | US9133160, 31
TypeSmall organic molecule
Emp. Form.C15H12F3N3
Mol. Mass.291.2711
SMILESCc1ccncc1-c1cccc2n(CC(F)(F)F)cnc12