Reaction Details
TargetSteroid 21-hydroxylase
LigandBDBM50156282
Substrate/Competitorn/a
Meas. Tech.ChEMBL_1563733 (CHEMBL3784034)
IC50 1050±n/a nM
Citation Huang, AJayaraman, LFura, AVite, GDTrainor, GLGottardis, MMSpires, TESpires, VMRizzo, CAObermeier, MTElzinga, PATodderud, GFan, YNewitt, JABeyer, SMZhu, YWarrack, BMGoodenough, AKTebben, AJDoweyko, AMGold, DLBalog, A Discovery of the Selective CYP17A1 Lyase Inhibitor BMS-351 for the Treatment of Prostate Cancer. ACS Med Chem Lett7:40-5 (2016) 
 
Steroid 21-hydroxylase
Name:Steroid 21-hydroxylase
Type:PROTEIN
Mol. Mass.:55896.25
Organism:Homo sapiens (Human)
Description:ChEMBL_1498865
Residue:494
BDBM50156282
NameBDBM50156282
Synonyms:CHEMBL3780847
TypeSmall organic molecule
Emp. Form.C24H31NO
Mol. Mass.349.509
SMILES[H][C@@]12CC=C3C[C@@H](O)CC[C@]3(C)C1CC[C@@]1(C)C2CC=C1c1cccnc1