Reaction Details
TargetHepatocyte growth factor receptor
LigandBDBM50384121
Substrate/Competitorn/a
Meas. Tech.ChEMBL_1568316 (CHEMBL3788750)
IC50 0.600±n/a nM
Citation Boezio, AACopeland, KWRex, KK Albrecht, BBauer, DBellon, SFBoezio, CBroome, MAChoquette, DCoxon, ADussault, IHirai, SLewis, RLin, MHLohman, JLiu, JPeterson, EAPotashman, MShimanovich, RTeffera, YWhittington, DAVaida, KRHarmange, JC Discovery of (R)-6-(1-(8-Fluoro-6-(1-methyl-1H-pyrazol-4-yl)-[1,2,4]triazolo[4,3-a]pyridin-3-yl)ethyl)-3-(2-methoxyethoxy)-1,6-naphthyridin-5(6H)-one (AMG 337), a Potent and Selective Inhibitor of MET with High Unbound Target Coverage and Robust In Vivo Antitumor Activity. J Med Chem59:2328-42 (2016) 
 
Hepatocyte growth factor receptor
Name:Hepatocyte growth factor receptor
Type:Protein
Mol. Mass.:155559.73
Organism:Homo sapiens (Human)
Description:P08581
Residue:1390
BDBM50384121
NameBDBM50384121
Synonyms:CHEMBL2029678
TypeSmall organic molecule
Emp. Form.C23H22N6O3S
Mol. Mass.462.524
SMILESCOCCOc1cnc2ccc(cc2c1)[C@H](C)n1nnc2ccn(-c3cc(C)ns3)c(=O)c12