Reaction Details
TargetSphingosine 1-phosphate receptor 3
LigandBDBM50156671
Substrate/Competitorn/a
Meas. Tech.ChEMBL_1570718 (CHEMBL3795086)
EC50 2900±n/a nM
Citation Guo, JWatterson, SHSpergel, SHKempson, JLangevine, CMShen, DRYarde, MCvijic, MEBanas, DLiu, RSuchard, SJGillooly, KTaylor, TRex-Rabe, SShuster, DJMcIntyre, KWCornelius, GD'Arienzo, CMarino, ABalimane, PSalter-Cid, LMcKinnon, MBarrish, JCCarter, PHPitts, WJXie, JDyckman, AJ Identification and synthesis of potent and selective pyridyl-isoxazole based agonists of sphingosine-1-phosphate 1 (S1P1). Bioorg Med Chem Lett26:2470-4 (2016) 
 
Sphingosine 1-phosphate receptor 3
Name:Sphingosine 1-phosphate receptor 3
Type:G Protein-Coupled Receptor (GPCR)
Mol. Mass.:42278.13
Organism:Homo sapiens (Human)
Description:Q99500
Residue:378
BDBM50156671
NameBDBM50156671
Synonyms:CHEMBL3794145
TypeSmall organic molecule
Emp. Form.C22H16F3N5O4
Mol. Mass.471.3887
SMILESOC(=O)C1CN(Cc2ccc(cc2)-c2noc(n2)-c2onc(c2C(F)(F)F)-c2ccccn2)C1