Reaction Details
TargetSphingosine 1-phosphate receptor 1
LigandBDBM50156676
Substrate/Competitorn/a
Meas. Tech.ChEMBL_1570717 (CHEMBL3795085)
EC50 0.820000±n/a nM
Citation Guo, JWatterson, SHSpergel, SHKempson, JLangevine, CMShen, DRYarde, MCvijic, MEBanas, DLiu, RSuchard, SJGillooly, KTaylor, TRex-Rabe, SShuster, DJMcIntyre, KWCornelius, GD'Arienzo, CMarino, ABalimane, PSalter-Cid, LMcKinnon, MBarrish, JCCarter, PHPitts, WJXie, JDyckman, AJ Identification and synthesis of potent and selective pyridyl-isoxazole based agonists of sphingosine-1-phosphate 1 (S1P1). Bioorg Med Chem Lett26:2470-4 (2016) 
 
Sphingosine 1-phosphate receptor 1
Name:Sphingosine 1-phosphate receptor 1
Type:Enzyme
Mol. Mass.:42836.02
Organism:Homo sapiens (Human)
Description:P21453
Residue:382
BDBM50156676
NameBDBM50156676
Synonyms:CHEMBL3793185
TypeSmall organic molecule
Emp. Form.C24H23N5O4
Mol. Mass.445.4705
SMILESCCCc1c(noc1-c1ccccn1)-c1nc(no1)-c1ccc(CN2CC(C2)C(O)=O)cc1