Reaction Details
TargetRho-associated protein kinase 2
LigandBDBM50156793
Substrate/Competitorn/a
Meas. Tech.ChEMBL_1571376 (CHEMBL3796494)
Ki 1.000000±n/a nM
Citation Sturdivant, JMRoyalty, SMLin, CWMoore, LAYingling, JDLaethem, CLSherman, BHeintzelman, GRKopczynski, CCdeLong, MA Discovery of the ROCK inhibitor netarsudil for the treatment of open-angle glaucoma. Bioorg Med Chem Lett26:2475-80 (2016) 
 
Rho-associated protein kinase 2
Name:Rho-associated protein kinase 2
Type:Protein
Mol. Mass.:160885.43
Organism:Homo sapiens (Human)
Description:O75116
Residue:1388
BDBM50156793
NameBDBM50156793
Synonyms:CHEMBL3792921
TypeSmall organic molecule
Emp. Form.C18H16FN3O
Mol. Mass.309.3375
SMILESNCC(C(=O)Nc1ccc2cnccc2c1)c1ccc(F)cc1