Reaction Details
TargetProtein arginine N-methyltransferase 6
LigandBDBM50158391
Substrate/Competitorn/a
Meas. Tech.ChEMBL_1564181 (CHEMBL3784078)
IC50 136000±n/a nM
Citation Ferreira de Freitas, REram, MSSzewczyk, MMSteuber, HSmil, DWu, HLi, FSenisterra, GDong, ABrown, PJHitchcock, MMoosmayer, DStegmann, CMEgner, UArrowsmith, CBarsyte-Lovejoy, DVedadi, MSchapira, M Discovery of a Potent Class I Protein Arginine Methyltransferase Fragment Inhibitor. J Med Chem59:1176-83 (2016) 
 
Protein arginine N-methyltransferase 6
Name:Protein arginine N-methyltransferase 6
Type:Protein
Mol. Mass.:41928.48
Organism:Homo sapiens (Human)
Description:n/a
Residue:375
BDBM50158391
NameBDBM50158391
Synonyms:CHEMBL3781682
TypeSmall organic molecule
Emp. Form.C12H14N2S
Mol. Mass.218.318
SMILESCNCc1cccc(c1)-c1csc(C)n1