Reaction Details
TargetHistone-arginine methyltransferase CARM1
LigandBDBM50158375
Substrate/Competitorn/a
Meas. Tech.ChEMBL_1564179 (CHEMBL3784076)
IC50 27±n/a nM
Citation Ferreira de Freitas, REram, MSSzewczyk, MMSteuber, HSmil, DWu, HLi, FSenisterra, GDong, ABrown, PJHitchcock, MMoosmayer, DStegmann, CMEgner, UArrowsmith, CBarsyte-Lovejoy, DVedadi, MSchapira, M Discovery of a Potent Class I Protein Arginine Methyltransferase Fragment Inhibitor. J Med Chem59:1176-83 (2016) 
 
Histone-arginine methyltransferase CARM1
Name:Histone-arginine methyltransferase CARM1
Type:Protein
Mol. Mass.:65855.47
Organism:Homo sapiens (Human)
Description:Q86X55
Residue:608
BDBM50158375
NameBDBM50158375
Synonyms:CHEMBL3781284
TypeSmall organic molecule
Emp. Form.C24H20F3N7O2
Mol. Mass.495.4565
SMILESC[C@@H](N)C(=O)NCc1cccc(c1)-n1nc(cc1-c1nnc(o1)-c1cccc2[nH]ccc12)C(F)(F)F