Reaction Details
TargetHistone-arginine methyltransferase CARM1
LigandBDBM50158097
Substrate/Competitorn/a
Meas. Tech.ChEMBL_1564308 (CHEMBL3784629)
IC50 200±n/a nM
Citation Ferreira de Freitas, REram, MSSzewczyk, MMSteuber, HSmil, DWu, HLi, FSenisterra, GDong, ABrown, PJHitchcock, MMoosmayer, DStegmann, CMEgner, UArrowsmith, CBarsyte-Lovejoy, DVedadi, MSchapira, M Discovery of a Potent Class I Protein Arginine Methyltransferase Fragment Inhibitor. J Med Chem59:1176-83 (2016) 
 
Histone-arginine methyltransferase CARM1
Name:Histone-arginine methyltransferase CARM1
Type:Protein
Mol. Mass.:65855.47
Organism:Homo sapiens (Human)
Description:Q86X55
Residue:608
BDBM50158097
NameBDBM50158097
Synonyms:CHEMBL3780701
TypeSmall organic molecule
Emp. Form.C9H20N2
Mol. Mass.156.2685
SMILESCNCCN1CCC(C)CC1