Reaction Details
TargetProtein arginine N-methyltransferase 3 [N508S]
LigandBDBM50158095
Substrate/Competitorn/a
Meas. Tech.ChEBML_1564307
IC50 35000±n/a nM
Citation Ferreira de Freitas, REram, MSSzewczyk, MMSteuber, HSmil, DWu, HLi, FSenisterra, GDong, ABrown, PJHitchcock, MMoosmayer, DStegmann, CMEgner, UArrowsmith, CBarsyte-Lovejoy, DVedadi, MSchapira, M Discovery of a Potent Class I Protein Arginine Methyltransferase Fragment Inhibitor. J Med Chem59:1176-83 (2016) 
 
Protein arginine N-methyltransferase 3 [N508S]
Name:Protein arginine N-methyltransferase 3 [N508S]
Type:Protein
Mol. Mass.:59859.85
Organism:Homo sapiens (Human)
Description:O60678[N508S]
Residue:531
BDBM50158095
NameBDBM50158095
Synonyms:CHEMBL3780444
TypeSmall organic molecule
Emp. Form.C5H14N2
Mol. Mass.102.1781
SMILESCNCCN(C)C