Reaction Details
TargetAcetylcholinesterase
LigandBDBM50160077
Substrate/Competitorn/a
Meas. Tech.ChEMBL_1565849 (CHEMBL3789712)
IC50 852±n/a nM
Citation Sawatzky, EWehle, SKling, BWendrich, JBringmann, GSotriffer, CAHeilmann, JDecker, M Discovery of Highly Selective and Nanomolar Carbamate-Based Butyrylcholinesterase Inhibitors by Rational Investigation into Their Inhibition Mode. J Med Chem59:2067-82 (2016) 
 
Acetylcholinesterase
Name:Acetylcholinesterase
Type:Enzyme
Mol. Mass.:67792.70
Organism:Homo sapiens (Human)
Description:P22303
Residue:614
BDBM50160077
NameBDBM50160077
Synonyms:CHEMBL3785861
TypeSmall organic molecule
Emp. Form.C22H32N4O2
Mol. Mass.384.5151
SMILESCCCCCCCNC(=O)Oc1ccc2N(C)C(N(C)Cc2c1)c1cc[nH]c1