Reaction Details
TargetCholinesterase
LigandBDBM50160078
Substrate/Competitorn/a
Meas. Tech.ChEMBL_1565850 (CHEMBL3789713)
IC50 13±n/a nM
Citation Sawatzky, EWehle, SKling, BWendrich, JBringmann, GSotriffer, CAHeilmann, JDecker, M Discovery of Highly Selective and Nanomolar Carbamate-Based Butyrylcholinesterase Inhibitors by Rational Investigation into Their Inhibition Mode. J Med Chem59:2067-82 (2016) 
 
Cholinesterase
Name:Cholinesterase
Type:Homotetramer
Mol. Mass.:68422.27
Organism:Homo sapiens (Human)
Description:P06276
Residue:602
BDBM50160078
NameBDBM50160078
Synonyms:CHEMBL3787613
TypeSmall organic molecule
Emp. Form.C22H31N3O2S
Mol. Mass.401.565
SMILESCCCCCCCNC(=O)Oc1ccc2N(C)C(N(C)Cc2c1)c1cccs1