Reaction Details
TargetCholinesterase
LigandBDBM50160077
Substrate/Competitorn/a
Meas. Tech.ChEMBL_1565847 (CHEMBL3789710)
IC50 23±n/a nM
Citation Sawatzky, EWehle, SKling, BWendrich, JBringmann, GSotriffer, CAHeilmann, JDecker, M Discovery of Highly Selective and Nanomolar Carbamate-Based Butyrylcholinesterase Inhibitors by Rational Investigation into Their Inhibition Mode. J Med Chem59:2067-82 (2016) 
 
Cholinesterase
Name:Cholinesterase
Type:Enzyme
Mol. Mass.:65643.35
Organism:Equus caballus (Horse)
Description:P81908
Residue:574
BDBM50160077
NameBDBM50160077
Synonyms:CHEMBL3785861
TypeSmall organic molecule
Emp. Form.C22H32N4O2
Mol. Mass.384.5151
SMILESCCCCCCCNC(=O)Oc1ccc2N(C)C(N(C)Cc2c1)c1cc[nH]c1