Reaction Details
TargetMonoglyceride lipase
LigandBDBM50160285
Substrate/Competitorn/a
Meas. Tech.ChEMBL_1566097 (CHEMBL3791725)
IC50>10000±n/a nM
Citation Brindisi, MMaramai, SGemma, SBrogi, SGrillo, ADi Cesare Mannelli, LGabellieri, ELamponi, SSaponara, SGorelli, BTedesco, DBonfiglio, TLandry, CJung, KMArmirotti, ALuongo, LLigresti, APiscitelli, FBertucci, CDehouck, MPCampiani, GMaione, SGhelardini, CPittaluga, APiomelli, DDi Marzo, VButini, S Development and Pharmacological Characterization of Selective Blockers of 2-Arachidonoyl Glycerol Degradation with Efficacy in Rodent Models of Multiple Sclerosis and Pain. J Med Chem59:2612-32 (2016) 
 
Monoglyceride lipase
Name:Monoglyceride lipase
Type:Hydrolase
Mol. Mass.:33264.56
Organism:Homo sapiens (Human)
Description:Human recombinant MGL (Cayman Chemical, cat# 10008354).
Residue:303
BDBM50160285
NameBDBM50160285
Synonyms:CHEMBL3786786
TypeSmall organic molecule
Emp. Form.C8H12N4O
Mol. Mass.180.2071
SMILESO=C(N1CCCCC1)n1cncn1