Reaction Details
TargetMonoglyceride lipase
LigandBDBM50160289
Substrate/Competitorn/a
Meas. Tech.ChEMBL_1566097 (CHEMBL3791725)
IC50>10000±n/a nM
Citation Brindisi, MMaramai, SGemma, SBrogi, SGrillo, ADi Cesare Mannelli, LGabellieri, ELamponi, SSaponara, SGorelli, BTedesco, DBonfiglio, TLandry, CJung, KMArmirotti, ALuongo, LLigresti, APiscitelli, FBertucci, CDehouck, MPCampiani, GMaione, SGhelardini, CPittaluga, APiomelli, DDi Marzo, VButini, S Development and Pharmacological Characterization of Selective Blockers of 2-Arachidonoyl Glycerol Degradation with Efficacy in Rodent Models of Multiple Sclerosis and Pain. J Med Chem59:2612-32 (2016) 
 
Monoglyceride lipase
Name:Monoglyceride lipase
Type:Hydrolase
Mol. Mass.:33264.56
Organism:Homo sapiens (Human)
Description:Human recombinant MGL (Cayman Chemical, cat# 10008354).
Residue:303
BDBM50160289
NameBDBM50160289
Synonyms:CHEMBL3785148
TypeSmall organic molecule
Emp. Form.C28H27FN2O3
Mol. Mass.458.524
SMILESFc1ccc(cc1)[C@@H]1[C@H](N(C2CCN(Cc3ccccc3)CC2)C1=O)c1ccc2OCOc2c1