Reaction Details
TargetMonoglyceride lipase
LigandBDBM60622
Substrate/Competitorn/a
Meas. Tech.ChEMBL_1566109 (CHEMBL3791993)
IC50 4440±n/a nM
Citation Brindisi, MMaramai, SGemma, SBrogi, SGrillo, ADi Cesare Mannelli, LGabellieri, ELamponi, SSaponara, SGorelli, BTedesco, DBonfiglio, TLandry, CJung, KMArmirotti, ALuongo, LLigresti, APiscitelli, FBertucci, CDehouck, MPCampiani, GMaione, SGhelardini, CPittaluga, APiomelli, DDi Marzo, VButini, S Development and Pharmacological Characterization of Selective Blockers of 2-Arachidonoyl Glycerol Degradation with Efficacy in Rodent Models of Multiple Sclerosis and Pain. J Med Chem59:2612-32 (2016) 
 
Monoglyceride lipase
Name:Monoglyceride lipase
Type:Hydrolase
Mol. Mass.:33264.56
Organism:Homo sapiens (Human)
Description:Human recombinant MGL (Cayman Chemical, cat# 10008354).
Residue:303
BDBM60622
NameBDBM60622
Synonyms:BDBM50300355 US9133148, A
Typen/a
Emp. Form.C27H24N2O9
Mol. Mass.520.4875
SMILESOC(C1CCN(CC1)C(=O)Oc1ccc(cc1)[N+]([O-])=O)(c1ccc2OCOc2c1)c1ccc2OCOc2c1