Reaction Details
TargetProstaglandin E2 receptor EP4 subtype
LigandBDBM50107283
Substrate/Competitorn/a
Meas. Tech.ChEMBL_1571690 (CHEMBL3795721)
IC50 1520±n/a nM
Citation Blanco, MJVetman, TChandrasekhar, SFisher, MJHarvey, AKuklish, SLChambers, MLin, CMudra, DOskins, JWang, XSYu, XPWarshawsky, AM Identification and biological activity of 6-alkyl-substituted 3-methyl-pyridine-2-carbonyl amino dimethyl-benzoic acid EP4 antagonists. Bioorg Med Chem Lett26:2303-7 (2016) 
 
Prostaglandin E2 receptor EP4 subtype
Name:Prostaglandin E2 receptor EP4 subtype
Type:Enzyme
Mol. Mass.:53134.53
Organism:Homo sapiens (Human)
Description:P35408
Residue:488
BDBM50107283
NameBDBM50107283
Synonyms:AAT-007 Grapiprant RQ-00000007 | RQ-7
TypeSmall organic molecule
Emp. Form.C26H29N5O3S
Mol. Mass.491.605
SMILESCCc1nc2c(C)nc(C)cc2n1-c1ccc(CCNC(=O)NS(=O)(=O)c2ccc(C)cc2)cc1