Reaction Details
TargetCyclin-dependent kinase 8
LigandBDBM50163849
Substrate/Competitorn/a
Meas. Tech.ChEMBL_1572641 (CHEMBL3803436)
IC50 15±n/a nM
Citation Mallinger, ASchiemann, KRink, CStieber, FCalderini, MCrumpler, SStubbs, MAdeniji-Popoola, OPoeschke, OBusch, MCzodrowski, PMusil, DSchwarz, DOrtiz-Ruiz, MJSchneider, RThai, CValenti, Mde Haven Brandon, ABurke, RWorkman, PDale, TWienke, DClarke, PAEsdar, CRaynaud, FIEccles, SARohdich, FBlagg, J Discovery of Potent, Selective, and Orally Bioavailable Small-Molecule Modulators of the Mediator Complex-Associated Kinases CDK8 and CDK19. J Med Chem59:1078-101 (2016) 
 
Cyclin-dependent kinase 8
Name:Cyclin-dependent kinase 8
Type:Serine/threonine-protein kinase
Mol. Mass.:53300.21
Organism:Homo sapiens (Human)
Description:P49336
Residue:464
BDBM50163849
NameBDBM50163849
Synonyms:CHEMBL3797212
TypeSmall organic molecule
Emp. Form.C24H24F3N5O
Mol. Mass.455.4755
SMILESCn1cc(cn1)-c1ccc(cc1)-c1cncc(c1N1CCC2(CCNC2=O)CC1)C(F)(F)F