Reaction Details
TargetHistone deacetylase 8
LigandBDBM50164658
Substrate/Competitorn/a
Meas. Tech.ChEMBL_1575027 (CHEMBL3803862)
IC50 70±n/a nM
Citation Heimburg, TChakrabarti, ALancelot, JMarek, MMelesina, JHauser, ATShaik, TBDuclaud, SRobaa, DErdmann, FSchmidt, MRomier, CPierce, RJJung, MSippl, W Structure-Based Design and Synthesis of Novel Inhibitors Targeting HDAC8 from Schistosoma mansoni for the Treatment of Schistosomiasis. J Med Chem59:2423-35 (2016) 
 
Histone deacetylase 8
Name:Histone deacetylase 8
Type:Enzyme
Mol. Mass.:41749.60
Organism:Homo sapiens (Human)
Description:Q9BY41
Residue:377
BDBM50164658
NameBDBM50164658
Synonyms:CHEMBL3798268
TypeSmall organic molecule
Emp. Form.C9H12N2O2
Mol. Mass.180.2038
SMILESCN(C)c1cccc(c1)C(=O)NO