Reaction Details
TargetHistone deacetylase 8
LigandBDBM50164539
Substrate/Competitorn/a
Meas. Tech.ChEMBL_1575027 (CHEMBL3803862)
IC50 88±n/a nM
Citation Heimburg, TChakrabarti, ALancelot, JMarek, MMelesina, JHauser, ATShaik, TBDuclaud, SRobaa, DErdmann, FSchmidt, MRomier, CPierce, RJJung, MSippl, W Structure-Based Design and Synthesis of Novel Inhibitors Targeting HDAC8 from Schistosoma mansoni for the Treatment of Schistosomiasis. J Med Chem59:2423-35 (2016) 
 
Histone deacetylase 8
Name:Histone deacetylase 8
Type:Enzyme
Mol. Mass.:41749.60
Organism:Homo sapiens (Human)
Description:Q9BY41
Residue:377
BDBM50164539
NameBDBM50164539
Synonyms:CHEMBL3798870
TypeSmall organic molecule
Emp. Form.C15H14N2O4
Mol. Mass.286.2827
SMILESCOc1ccc(cc1NC(=O)c1ccccc1)C(=O)NO