Reaction Details
TargetDeath-associated protein kinase 2
LigandBDBM50166121
Substrate/Competitorn/a
Meas. Tech.ChEMBL_1575379 (CHEMBL3802097)
IC50 2300±n/a nM
Citation Jung, MEByun, BJKim, HMLee, JYPark, JHLee, NSon, YHChoi, SUYang, KMKim, SJLee, KKim, YCChoi, G Discovery of indirubin derivatives as new class of DRAK2 inhibitors from high throughput screening. Bioorg Med Chem Lett26:2719-23 (2016) 
 
Death-associated protein kinase 2
Name:Death-associated protein kinase 2
Type:PROTEIN
Mol. Mass.:42900.09
Organism:Homo sapiens (Human)
Description:ChEMBL_774557
Residue:370
BDBM50166121
NameBDBM50166121
Synonyms:CHEMBL3797480
TypeSmall organic molecule
Emp. Form.C21H20N4O3
Mol. Mass.376.4085
SMILESCCCCC(=O)Nc1ccc2NC(=O)\C(=C3/Nc4ccccc4/C/3=N\O)c2c1