Reaction Details
TargetDeath-associated protein kinase 1
LigandBDBM50166076
Substrate/Competitorn/a
Meas. Tech.ChEMBL_1575378 (CHEMBL3802096)
IC50 510±n/a nM
Citation Jung, MEByun, BJKim, HMLee, JYPark, JHLee, NSon, YHChoi, SUYang, KMKim, SJLee, KKim, YCChoi, G Discovery of indirubin derivatives as new class of DRAK2 inhibitors from high throughput screening. Bioorg Med Chem Lett26:2719-23 (2016) 
 
Death-associated protein kinase 1
Name:Death-associated protein kinase 1
Type:PROTEIN
Mol. Mass.:160053.35
Organism:Homo sapiens (Human)
Description:ChEMBL_1517177
Residue:1430
BDBM50166076
NameBDBM50166076
Synonyms:CHEMBL3799585
TypeSmall organic molecule
Emp. Form.C20H18N4O3
Mol. Mass.362.3819
SMILESCCCC(=O)Nc1ccc2NC(=O)\C(=C3/Nc4ccccc4/C/3=N\O)c2c1