Reaction Details
TargetMicrotubule-associated protein 2
LigandBDBM50167280
Substrate/Competitorn/a
Meas. Tech.ChEMBL_1573781 (CHEMBL3803202)
EC50 1995±n/a nM
Citation McBride, CCheruvallath, ZKomandla, MTang, MFarrell, PLawson, JDVanderpool, DWu, YDougan, DRPlonowski, AHolub, CLarson, C Discovery of potent, reversible MetAP2 inhibitors via fragment based drug discovery and structure based drug design-Part 2. Bioorg Med Chem Lett26:2779-2783 (2016) 
 
Microtubule-associated protein 2
Name:Microtubule-associated protein 2
Type:PROTEIN
Mol. Mass.:199423.64
Organism:Homo sapiens (Human)
Description:ChEMBL_107603
Residue:1827
BDBM50167280
NameBDBM50167280
Synonyms:CHEMBL3797259
TypeSmall organic molecule
Emp. Form.C18H15FN4O2
Mol. Mass.338.3357
SMILESOCCNC(=O)c1ccc(cc1)-n1c2cn[nH]c2c2cc(F)ccc12