Reaction Details
TargetMicrotubule-associated protein 2
LigandBDBM50167275
Substrate/Competitorn/a
Meas. Tech.ChEMBL_1573781 (CHEMBL3803202)
EC50 10000±n/a nM
Citation McBride, CCheruvallath, ZKomandla, MTang, MFarrell, PLawson, JDVanderpool, DWu, YDougan, DRPlonowski, AHolub, CLarson, C Discovery of potent, reversible MetAP2 inhibitors via fragment based drug discovery and structure based drug design-Part 2. Bioorg Med Chem Lett26:2779-2783 (2016) 
 
Microtubule-associated protein 2
Name:Microtubule-associated protein 2
Type:PROTEIN
Mol. Mass.:199423.64
Organism:Homo sapiens (Human)
Description:ChEMBL_107603
Residue:1827
BDBM50167275
NameBDBM50167275
Synonyms:CHEMBL3798249
TypeSmall organic molecule
Emp. Form.C14H9ClN4
Mol. Mass.268.701
SMILESClc1ccc2c(c1)n(-c1cccnc1)c1cn[nH]c21