Reaction Details
TargetCytochrome P450 1A2
LigandBDBM50167281
Substrate/Competitorn/a
Meas. Tech.ChEMBL_1573782 (CHEMBL3803203)
IC50 19953±n/a nM
Citation McBride, CCheruvallath, ZKomandla, MTang, MFarrell, PLawson, JDVanderpool, DWu, YDougan, DRPlonowski, AHolub, CLarson, C Discovery of potent, reversible MetAP2 inhibitors via fragment based drug discovery and structure based drug design-Part 2. Bioorg Med Chem Lett26:2779-2783 (2016) 
 
Cytochrome P450 1A2
Name:Cytochrome P450 1A2
Type:Enzyme
Mol. Mass.:58423.38
Organism:Homo sapiens (Human)
Description:P05177
Residue:516
BDBM50167281
NameBDBM50167281
Synonyms:CHEMBL3799796
TypeSmall organic molecule
Emp. Form.C17H13FN6
Mol. Mass.320.3237
SMILESCc1nc2n(C)cnc2cc1-n1c2cn[nH]c2c2cc(F)ccc12