Reaction Details
TargetPancreatic triacylglycerol lipase
LigandBDBM50168023
Substrate/Competitorn/a
Meas. Tech.ChEMBL_1575199 (CHEMBL3800919)
IC50 570±n/a nM
Citation Ha, MTTran, MHAh, KJJo, KJKim, JKim, WDCheon, WJWoo, MHRyu, SHMin, BS Potential pancreatic lipase inhibitory activity of phenolic constituents from the root bark of Morus alba L. Bioorg Med Chem Lett26:2788-2794 (2016) 
 
Pancreatic triacylglycerol lipase
Name:Pancreatic triacylglycerol lipase
Type:Enzyme
Mol. Mass.:50080.69
Organism:Sus scrofa (Pig)
Description:P00591
Residue:450
BDBM50168023
NameBDBM50168023
Synonyms:CHEMBL3800628
TypeSmall organic molecule
Emp. Form.C30H36O4
Mol. Mass.460.6044
SMILES[#6]-[#8]-c1cc(-[#8])cc(-c2cc3ccc(-[#8])cc3o2)c1-[#6]\[#6]=[#6](\[#6])-[#6]-[#6]\[#6]=[#6](\[#6])-[#6]-[#6]\[#6]=[#6](/[#6])-[#6]