Reaction Details
TargetMetabotropic glutamate receptor 5
LigandBDBM50169541
Substrate/Competitorn/a
Meas. Tech.ChEMBL_1578233 (CHEMBL3807497)
EC50 0.830000±n/a nM
Citation Yang, FSnyder, LBBalakrishnan, ABrown, JMSivarao, DVEaston, AFernandes, AGulianello, MHanumegowda, UMHuang, HHuang, YJones, KMLi, YWMatchett, MMattson, GMiller, RSantone, KSSenapati, AShields, EESimutis, FJWestphal, RWhiterock, VJBronson, JJMacor, JEDegnan, AP Discovery and Preclinical Evaluation of BMS-955829, a Potent Positive Allosteric Modulator of mGluR5. ACS Med Chem Lett7:289-93 (2016) 
 
Metabotropic glutamate receptor 5
Name:Metabotropic glutamate receptor 5
Type:Enzyme
Mol. Mass.:132484.72
Organism:Homo sapiens (Human)
Description:n/a
Residue:1212
BDBM50169541
NameBDBM50169541
Synonyms:CHEMBL3805542
TypeSmall organic molecule
Emp. Form.C22H15FN2O2
Mol. Mass.358.3651
SMILESFc1cccc(c1)[C@H]1OC(=O)N[C@@H]1c1cncc(c1)C#Cc1ccccc1