Reaction Details
TargetMetabotropic glutamate receptor 5
LigandBDBM50169544
Substrate/Competitorn/a
Meas. Tech.ChEMBL_1578233 (CHEMBL3807497)
EC50>3000±n/a nM
Citation Yang, FSnyder, LBBalakrishnan, ABrown, JMSivarao, DVEaston, AFernandes, AGulianello, MHanumegowda, UMHuang, HHuang, YJones, KMLi, YWMatchett, MMattson, GMiller, RSantone, KSSenapati, AShields, EESimutis, FJWestphal, RWhiterock, VJBronson, JJMacor, JEDegnan, AP Discovery and Preclinical Evaluation of BMS-955829, a Potent Positive Allosteric Modulator of mGluR5. ACS Med Chem Lett7:289-93 (2016) 
 
Metabotropic glutamate receptor 5
Name:Metabotropic glutamate receptor 5
Type:Enzyme
Mol. Mass.:132484.72
Organism:Homo sapiens (Human)
Description:n/a
Residue:1212
BDBM50169544
NameBDBM50169544
Synonyms:CHEMBL3805655
TypeSmall organic molecule
Emp. Form.C22H16N2O2
Mol. Mass.340.3746
SMILESO=C1N[C@@H]([C@H](O1)c1ccccc1)c1cc(ccn1)C#Cc1ccccc1