Reaction Details
TargetRAC-alpha serine/threonine-protein kinase
LigandBDBM50170422
Substrate/Competitorn/a
Meas. Tech.ChEMBL_1577690 (CHEMBL3807471)
IC50 1260±n/a nM
Citation Zhan, WXu, LDong, XDong, JYi, XMa, XQiu, NLi, JYang, BZhou, YHu, Y Design, synthesis and biological evaluation of pyrazol-furan carboxamide analogues as novel Akt kinase inhibitors. Eur J Med Chem117:47-58 (2016) 
 
RAC-alpha serine/threonine-protein kinase
Name:RAC-alpha serine/threonine-protein kinase
Type:Enzyme
Mol. Mass.:55681.25
Organism:Homo sapiens (Human)
Description:P31749
Residue:480
BDBM50170422
NameBDBM50170422
Synonyms:CHEMBL3805443
TypeSmall organic molecule
Emp. Form.C21H22BrCl2N5O
Mol. Mass.511.242
SMILESCn1cc(cc1C(=O)NC1(CCNCC1)c1ccc(Cl)c(Cl)c1)-c1c(Br)cnn1C